Information card for entry 4349704
Formula | C14 H8 Au Fe N7 |
Calculated formula | C14 H8 Au Fe N7 |
Title of publication | A ladder-type iron(ii) coordination polymer with enhanced spin-crossover behavior |
Authors of publication | Yan, Zheng; Zhu, Long-Feng; Zhu, Lian-Wen; Meng, Yan; Hoque, Md. Najbul; Liu, Jun-Liang; Chen, Yan-Cong; Ni, Zhao-Ping; Tong, Ming-Liang |
Journal of publication | Inorganic Chemistry Frontiers |
Year of publication | 2017 |
Journal volume | 4 |
Journal issue | 6 |
Pages of publication | 921 |
a | 11.604 ± 0.002 Å |
b | 15.736 ± 0.002 Å |
c | 10.479 ± 0.003 Å |
α | 90° |
β | 123.337 ± 0.007° |
γ | 90° |
Cell volume | 1598.6 ± 0.6 Å3 |
Cell temperature | 373 ± 2 K |
Ambient diffraction temperature | 373 ± 2 K |
Number of distinct elements | 5 |
Space group number | 12 |
Hermann-Mauguin space group symbol | C 1 2/m 1 |
Hall space group symbol | -C 2y |
Residual factor for all reflections | 0.0734 |
Residual factor for significantly intense reflections | 0.0422 |
Weighted residual factors for significantly intense reflections | 0.0906 |
Weighted residual factors for all reflections included in the refinement | 0.1153 |
Goodness-of-fit parameter for all reflections included in the refinement | 1.057 |
Diffraction radiation wavelength | 0.71073 Å |
Diffraction radiation type | MoKα |