Information card for entry 4349820
Formula | C28 H50 Bi2 I9 N8 O8 Pr |
Calculated formula | C28 H50 Bi2 I9 N8 O8 Pr |
Title of publication | Iodoargentate/iodobismuthate-based materials hybridized with lanthanide-containing metalloviologens: thermochromic behaviors and photocurrent responses |
Authors of publication | Wang, Dao-Hua; Zhao, Li-Ming; Lin, Xiao-Yan; Wang, Yu-Kang; Zhang, Wen-Ting; Song, Kai-Yue; Li, Hao-Hong; Chen, Zhi-Rong |
Journal of publication | Inorganic Chemistry Frontiers |
Year of publication | 2018 |
Journal volume | 5 |
Journal issue | 5 |
Pages of publication | 1162 |
a | 13.1331 ± 0.0016 Å |
b | 31.137 ± 0.004 Å |
c | 13.5282 ± 0.0017 Å |
α | 90° |
β | 93.366 ± 0.002° |
γ | 90° |
Cell volume | 5522.5 ± 1.2 Å3 |
Cell temperature | 175 K |
Ambient diffraction temperature | 175 K |
Number of distinct elements | 7 |
Space group number | 14 |
Hermann-Mauguin space group symbol | P 1 21/n 1 |
Hall space group symbol | -P 2yn |
Residual factor for all reflections | 0.0631 |
Residual factor for significantly intense reflections | 0.0492 |
Weighted residual factors for significantly intense reflections | 0.1177 |
Weighted residual factors for all reflections included in the refinement | 0.1247 |
Goodness-of-fit parameter for all reflections included in the refinement | 1.046 |
Diffraction radiation wavelength | 0.71073 Å |
Diffraction radiation type | MoKα |