Information card for entry 4349821
Formula | C26 H53 Ag6 I9 N8 O8 Sm |
Calculated formula | C26 H53 Ag6 I9 N8 O8 Sm |
Title of publication | Iodoargentate/iodobismuthate-based materials hybridized with lanthanide-containing metalloviologens: thermochromic behaviors and photocurrent responses |
Authors of publication | Wang, Dao-Hua; Zhao, Li-Ming; Lin, Xiao-Yan; Wang, Yu-Kang; Zhang, Wen-Ting; Song, Kai-Yue; Li, Hao-Hong; Chen, Zhi-Rong |
Journal of publication | Inorganic Chemistry Frontiers |
Year of publication | 2018 |
Journal volume | 5 |
Journal issue | 5 |
Pages of publication | 1162 |
a | 10.455 ± 0.002 Å |
b | 14.619 ± 0.003 Å |
c | 20.018 ± 0.004 Å |
α | 79.58 ± 0.03° |
β | 80.96 ± 0.03° |
γ | 89.11 ± 0.03° |
Cell volume | 2971.5 ± 1.1 Å3 |
Cell temperature | 293 ± 2 K |
Ambient diffraction temperature | 293 ± 2 K |
Number of distinct elements | 7 |
Space group number | 2 |
Hermann-Mauguin space group symbol | P -1 |
Hall space group symbol | -P 1 |
Residual factor for all reflections | 0.2147 |
Residual factor for significantly intense reflections | 0.0935 |
Weighted residual factors for significantly intense reflections | 0.2096 |
Weighted residual factors for all reflections included in the refinement | 0.2623 |
Goodness-of-fit parameter for all reflections included in the refinement | 0.943 |
Diffraction radiation wavelength | 0.71073 Å |
Diffraction radiation type | MoKα |