Information card for entry 4349822
Formula | C28 H50 Bi2 I9 La N8 O8 |
Calculated formula | C28 H50 Bi2 I9 La N8 O8 |
Title of publication | Iodoargentate/iodobismuthate-based materials hybridized with lanthanide-containing metalloviologens: thermochromic behaviors and photocurrent responses |
Authors of publication | Wang, Dao-Hua; Zhao, Li-Ming; Lin, Xiao-Yan; Wang, Yu-Kang; Zhang, Wen-Ting; Song, Kai-Yue; Li, Hao-Hong; Chen, Zhi-Rong |
Journal of publication | Inorganic Chemistry Frontiers |
Year of publication | 2018 |
Journal volume | 5 |
Journal issue | 5 |
Pages of publication | 1162 |
a | 13.368 ± 0.003 Å |
b | 31.511 ± 0.006 Å |
c | 18.594 ± 0.003 Å |
α | 90° |
β | 132.855 ± 0.01° |
γ | 90° |
Cell volume | 5742 ± 2 Å3 |
Cell temperature | 293 ± 2 K |
Ambient diffraction temperature | 293 ± 2 K |
Number of distinct elements | 7 |
Space group number | 14 |
Hermann-Mauguin space group symbol | P 1 21/c 1 |
Hall space group symbol | -P 2ybc |
Residual factor for all reflections | 0.1235 |
Residual factor for significantly intense reflections | 0.0905 |
Weighted residual factors for significantly intense reflections | 0.1906 |
Weighted residual factors for all reflections included in the refinement | 0.2033 |
Goodness-of-fit parameter for all reflections included in the refinement | 1.155 |
Diffraction radiation wavelength | 0.71073 Å |
Diffraction radiation type | MoKα |