Information card for entry 4349833
Formula | C43 H35 Cd N7 O6 |
Calculated formula | C43 H35 Cd N7 O6 |
Title of publication | A series of porous interpenetrating metal‒organic frameworks based on fluorescent ligands for nitroaromatic explosive detection |
Authors of publication | Zeng, Xiao-Shan; Xu, Hui-Ling; Xu, Yu-Ci; Li, Xiao-Qing; Nie, Zhao-Yang; Gao, Shu-Zhen; Xiao, Dong-Rong |
Journal of publication | Inorganic Chemistry Frontiers |
Year of publication | 2018 |
Journal volume | 5 |
Journal issue | 7 |
Pages of publication | 1622 |
a | 10.1231 ± 0.0002 Å |
b | 14.8998 ± 0.0003 Å |
c | 28.9502 ± 0.0007 Å |
α | 90° |
β | 94.192 ± 0.002° |
γ | 90° |
Cell volume | 4354.94 ± 0.16 Å3 |
Cell temperature | 100 ± 0.14 K |
Ambient diffraction temperature | 100 ± 0.14 K |
Number of distinct elements | 5 |
Space group number | 14 |
Hermann-Mauguin space group symbol | P 1 21/c 1 |
Hall space group symbol | -P 2ybc |
Residual factor for all reflections | 0.1072 |
Residual factor for significantly intense reflections | 0.0987 |
Weighted residual factors for significantly intense reflections | 0.2466 |
Weighted residual factors for all reflections included in the refinement | 0.2511 |
Goodness-of-fit parameter for all reflections included in the refinement | 1.189 |
Diffraction radiation wavelength | 1.54184 Å |
Diffraction radiation type | CuKα |