Information card for entry 4349834
Formula | C168 H154 Cd5 Cl4 N30 O23 |
Calculated formula | C168 H144 Cd5 Cl2 N30 O23 |
Title of publication | A series of porous interpenetrating metal‒organic frameworks based on fluorescent ligands for nitroaromatic explosive detection |
Authors of publication | Zeng, Xiao-Shan; Xu, Hui-Ling; Xu, Yu-Ci; Li, Xiao-Qing; Nie, Zhao-Yang; Gao, Shu-Zhen; Xiao, Dong-Rong |
Journal of publication | Inorganic Chemistry Frontiers |
Year of publication | 2018 |
Journal volume | 5 |
Journal issue | 7 |
Pages of publication | 1622 |
a | 21.0432 ± 0.0004 Å |
b | 17.4458 ± 0.0003 Å |
c | 26.3825 ± 0.0004 Å |
α | 90° |
β | 111.359 ± 0.0019° |
γ | 90° |
Cell volume | 9020.2 ± 0.3 Å3 |
Cell temperature | 100 K |
Ambient diffraction temperature | 100 K |
Number of distinct elements | 6 |
Space group number | 14 |
Hermann-Mauguin space group symbol | P 1 21/n 1 |
Hall space group symbol | -P 2yn |
Residual factor for all reflections | 0.0852 |
Residual factor for significantly intense reflections | 0.0764 |
Weighted residual factors for significantly intense reflections | 0.2152 |
Weighted residual factors for all reflections included in the refinement | 0.2235 |
Goodness-of-fit parameter for all reflections included in the refinement | 1.05 |
Diffraction radiation wavelength | 1.54184 Å |
Diffraction radiation type | CuKα |