Information card for entry 4349840
Formula | C62 H60 Cl2 Co2 N8 O14 S2 |
Calculated formula | C62 H60 Cl2 Co2 N8 O14 S2 |
Title of publication | Towards oxalate-bridged iron(ii), cobalt(ii), nickel(ii) and zinc(ii) complexes through oxotris(oxalato)niobate(v): an open air non-oxidizing synthetic route |
Authors of publication | Oliveira, Willian X. C.; Pereira, Cynthia L. M.; Pinheiro, Carlos B.; Lloret, Francesc; Julve, Miguel |
Journal of publication | Inorganic Chemistry Frontiers |
Year of publication | 2018 |
Journal volume | 5 |
Journal issue | 6 |
Pages of publication | 1294 |
a | 10.3328 ± 0.001 Å |
b | 12.2165 ± 0.0012 Å |
c | 13.0629 ± 0.0012 Å |
α | 82.207 ± 0.008° |
β | 84.709 ± 0.008° |
γ | 71.837 ± 0.009° |
Cell volume | 1550.1 ± 0.3 Å3 |
Cell temperature | 298 ± 2 K |
Ambient diffraction temperature | 298 ± 2 K |
Number of distinct elements | 7 |
Space group number | 2 |
Hermann-Mauguin space group symbol | P -1 |
Hall space group symbol | -P 1 |
Residual factor for all reflections | 0.0818 |
Residual factor for significantly intense reflections | 0.0506 |
Weighted residual factors for significantly intense reflections | 0.1205 |
Weighted residual factors for all reflections included in the refinement | 0.1409 |
Goodness-of-fit parameter for all reflections included in the refinement | 1.056 |
Diffraction radiation wavelength | 0.71073 Å |
Diffraction radiation type | MoKα |