Information card for entry 4349841
Formula | C186 H144 N24 Nb2 Ni6 O52.19 |
Calculated formula | C186 H144 N24 Nb2 Ni6 O52.22 |
Title of publication | Towards oxalate-bridged iron(ii), cobalt(ii), nickel(ii) and zinc(ii) complexes through oxotris(oxalato)niobate(v): an open air non-oxidizing synthetic route |
Authors of publication | Oliveira, Willian X. C.; Pereira, Cynthia L. M.; Pinheiro, Carlos B.; Lloret, Francesc; Julve, Miguel |
Journal of publication | Inorganic Chemistry Frontiers |
Year of publication | 2018 |
Journal volume | 5 |
Journal issue | 6 |
Pages of publication | 1294 |
a | 35.7961 ± 0.0016 Å |
b | 33.5952 ± 0.0013 Å |
c | 33.0784 ± 0.0018 Å |
α | 90° |
β | 90° |
γ | 90° |
Cell volume | 39779 ± 3 Å3 |
Cell temperature | 150 ± 2 K |
Ambient diffraction temperature | 150 ± 2 K |
Number of distinct elements | 6 |
Space group number | 43 |
Hermann-Mauguin space group symbol | F d d 2 |
Hall space group symbol | F 2 -2d |
Residual factor for all reflections | 0.0785 |
Residual factor for significantly intense reflections | 0.064 |
Weighted residual factors for significantly intense reflections | 0.1644 |
Weighted residual factors for all reflections included in the refinement | 0.1769 |
Goodness-of-fit parameter for all reflections included in the refinement | 1.032 |
Diffraction radiation wavelength | 0.71073 Å |
Diffraction radiation type | MoKα |