Information card for entry 4349876
Formula | C6 H12 Ag8 N16 O48 P S4 W12 |
Calculated formula | C8 H12 Ag8 N16 O48 P S4 W12 |
Title of publication | Engineering a polyoxometalate-based metal organic framework with more exposed active edge sites of Ag for visible light-driven selective oxidation of cis-cyclooctene |
Authors of publication | Lin, Xiaoling; Zhang, Mengling; Zhu, Mengmeng; Huang, Hui; Shi, Chunfeng; Liu, Yang; Kang, Zhenhui |
Journal of publication | Inorganic Chemistry Frontiers |
Year of publication | 2018 |
Journal volume | 5 |
Journal issue | 10 |
Pages of publication | 2493 |
a | 13.033 ± 0.0019 Å |
b | 22.665 ± 0.003 Å |
c | 11.9449 ± 0.0016 Å |
α | 90° |
β | 116.967 ± 0.002° |
γ | 90° |
Cell volume | 3144.8 ± 0.8 Å3 |
Cell temperature | 296 ± 2 K |
Ambient diffraction temperature | 296 ± 2 K |
Number of distinct elements | 8 |
Space group number | 14 |
Hermann-Mauguin space group symbol | P 1 21/c 1 |
Hall space group symbol | -P 2ybc |
Residual factor for all reflections | 0.0975 |
Residual factor for significantly intense reflections | 0.0778 |
Weighted residual factors for significantly intense reflections | 0.2319 |
Weighted residual factors for all reflections included in the refinement | 0.2391 |
Goodness-of-fit parameter for all reflections included in the refinement | 1.63 |
Diffraction radiation wavelength | 0.71073 Å |
Diffraction radiation type | MoKα |