Information card for entry 4349877
Formula | C8 H12 Ag8 Mo12 N16 O42 P S4 |
Calculated formula | C8 H12 Ag8 Mo12 N16 O42 P S4 |
Title of publication | Engineering a polyoxometalate-based metal organic framework with more exposed active edge sites of Ag for visible light-driven selective oxidation of cis-cyclooctene |
Authors of publication | Lin, Xiaoling; Zhang, Mengling; Zhu, Mengmeng; Huang, Hui; Shi, Chunfeng; Liu, Yang; Kang, Zhenhui |
Journal of publication | Inorganic Chemistry Frontiers |
Year of publication | 2018 |
Journal volume | 5 |
Journal issue | 10 |
Pages of publication | 2493 |
a | 24.88 ± 0.005 Å |
b | 10.683 ± 0.002 Å |
c | 22.308 ± 0.004 Å |
α | 90° |
β | 106.567 ± 0.004° |
γ | 90° |
Cell volume | 5683.2 ± 1.9 Å3 |
Cell temperature | 296 ± 2 K |
Ambient diffraction temperature | 296 ± 2 K |
Number of distinct elements | 8 |
Space group number | 15 |
Hermann-Mauguin space group symbol | C 1 2/c 1 |
Hall space group symbol | -C 2yc |
Residual factor for all reflections | 0.1035 |
Residual factor for significantly intense reflections | 0.0612 |
Weighted residual factors for significantly intense reflections | 0.1653 |
Weighted residual factors for all reflections included in the refinement | 0.192 |
Goodness-of-fit parameter for all reflections included in the refinement | 1.095 |
Diffraction radiation wavelength | 0.71073 Å |
Diffraction radiation type | MoKα |