Information card for entry 4349892
Formula | C38 H22 F9 N4 O6 S3 Tb |
Calculated formula | C38 H22 F9 N4 O6 S3 Tb |
Title of publication | Heteroleptic β-diketonate Ln(iii) complexes decorated with pyridyl substituted pyridazine ligands: synthesis, structure and luminescence properties |
Authors of publication | Khistiaeva, Viktoria V.; Melnikov, Alexey S.; Slavova, Sofia O.; Sizov, Vladimir V.; Starova, Galina L.; Koshevoy, Igor O.; Grachova, Elena V. |
Journal of publication | Inorganic Chemistry Frontiers |
Year of publication | 2018 |
Journal volume | 5 |
Journal issue | 12 |
Pages of publication | 3015 |
a | 10.2761 ± 0.0003 Å |
b | 21.4121 ± 0.0009 Å |
c | 18.9121 ± 0.0007 Å |
α | 90° |
β | 104.036 ± 0.004° |
γ | 90° |
Cell volume | 4037 ± 0.3 Å3 |
Cell temperature | 100 ± 2 K |
Ambient diffraction temperature | 100 ± 2 K |
Number of distinct elements | 7 |
Space group number | 14 |
Hermann-Mauguin space group symbol | P 1 21/c 1 |
Hall space group symbol | -P 2ybc |
Residual factor for all reflections | 0.1047 |
Residual factor for significantly intense reflections | 0.092 |
Weighted residual factors for significantly intense reflections | 0.1996 |
Weighted residual factors for all reflections included in the refinement | 0.2061 |
Goodness-of-fit parameter for all reflections included in the refinement | 1.151 |
Diffraction radiation probe | x-ray |
Diffraction radiation wavelength | 1.54184 Å |
Diffraction radiation type | CuKα |