Information card for entry 4349893
Formula | C38 H23 Eu F9 N4 O6 S3 |
Calculated formula | C38 H23 Eu F9 N4 O6 S3 |
Title of publication | Heteroleptic β-diketonate Ln(iii) complexes decorated with pyridyl substituted pyridazine ligands: synthesis, structure and luminescence properties |
Authors of publication | Khistiaeva, Viktoria V.; Melnikov, Alexey S.; Slavova, Sofia O.; Sizov, Vladimir V.; Starova, Galina L.; Koshevoy, Igor O.; Grachova, Elena V. |
Journal of publication | Inorganic Chemistry Frontiers |
Year of publication | 2018 |
Journal volume | 5 |
Journal issue | 12 |
Pages of publication | 3015 |
a | 24.2613 ± 0.0011 Å |
b | 10.2407 ± 0.0005 Å |
c | 16.5383 ± 0.0006 Å |
α | 90° |
β | 93.893 ± 0.004° |
γ | 90° |
Cell volume | 4099.5 ± 0.3 Å3 |
Cell temperature | 100 ± 2 K |
Ambient diffraction temperature | 100 ± 2 K |
Number of distinct elements | 7 |
Space group number | 13 |
Hermann-Mauguin space group symbol | P 1 2/c 1 |
Hall space group symbol | -P 2yc |
Residual factor for all reflections | 0.1165 |
Residual factor for significantly intense reflections | 0.0988 |
Weighted residual factors for significantly intense reflections | 0.2146 |
Weighted residual factors for all reflections included in the refinement | 0.2257 |
Goodness-of-fit parameter for all reflections included in the refinement | 1.166 |
Diffraction radiation probe | x-ray |
Diffraction radiation wavelength | 0.71073 Å |
Diffraction radiation type | MoKα |