Information card for entry 4349894
Formula | C38 H22 Dy F9 N4 O6 S3 |
Calculated formula | C38 H22 Dy F9 N4 O6 S3 |
Title of publication | Heteroleptic β-diketonate Ln(iii) complexes decorated with pyridyl substituted pyridazine ligands: synthesis, structure and luminescence properties |
Authors of publication | Khistiaeva, Viktoria V.; Melnikov, Alexey S.; Slavova, Sofia O.; Sizov, Vladimir V.; Starova, Galina L.; Koshevoy, Igor O.; Grachova, Elena V. |
Journal of publication | Inorganic Chemistry Frontiers |
Year of publication | 2018 |
Journal volume | 5 |
Journal issue | 12 |
Pages of publication | 3015 |
a | 10.2806 ± 0.0008 Å |
b | 21.385 ± 0.003 Å |
c | 18.8697 ± 0.0016 Å |
α | 90° |
β | 103.894 ± 0.01° |
γ | 90° |
Cell volume | 4027.1 ± 0.8 Å3 |
Cell temperature | 100 ± 2 K |
Ambient diffraction temperature | 100 ± 2 K |
Number of distinct elements | 7 |
Space group number | 14 |
Hermann-Mauguin space group symbol | P 1 21/c 1 |
Hall space group symbol | -P 2ybc |
Residual factor for all reflections | 0.1922 |
Residual factor for significantly intense reflections | 0.0976 |
Weighted residual factors for significantly intense reflections | 0.2099 |
Weighted residual factors for all reflections included in the refinement | 0.2691 |
Goodness-of-fit parameter for all reflections included in the refinement | 1.026 |
Diffraction radiation probe | x-ray |
Diffraction radiation wavelength | 1.54184 Å |
Diffraction radiation type | CuKα |