Information card for entry 4349898
Formula | C26 H32 N4 O7 Zn |
Calculated formula | C26 H32 N4 O7 Zn |
Title of publication | Efficient heterogeneous catalysis by dual ligand Zn(ii)/Cd(ii) MOFs for the Knoevenagel condensation reaction: adaptable synthetic routes, characterization, crystal structures and luminescence studies |
Authors of publication | Parmar, Bhavesh; Patel, Parth; Murali, Vishnu; Rachuri, Yadagiri; Kureshy, Rukhsana I.; Khan, Noor-ul H.; Suresh, Eringathodi |
Journal of publication | Inorganic Chemistry Frontiers |
Year of publication | 2018 |
Journal volume | 5 |
Journal issue | 10 |
Pages of publication | 2630 |
a | 9.4511 ± 0.0009 Å |
b | 12.3922 ± 0.0012 Å |
c | 12.6894 ± 0.0012 Å |
α | 64.829 ± 0.001° |
β | 72.113 ± 0.001° |
γ | 77.227 ± 0.002° |
Cell volume | 1273 ± 0.2 Å3 |
Cell temperature | 150 ± 2 K |
Ambient diffraction temperature | 150 ± 2 K |
Number of distinct elements | 5 |
Space group number | 2 |
Hermann-Mauguin space group symbol | P -1 |
Hall space group symbol | -P 1 |
Residual factor for all reflections | 0.0662 |
Residual factor for significantly intense reflections | 0.0623 |
Weighted residual factors for significantly intense reflections | 0.1797 |
Weighted residual factors for all reflections included in the refinement | 0.1841 |
Goodness-of-fit parameter for all reflections included in the refinement | 1.059 |
Diffraction radiation wavelength | 0.71073 Å |
Diffraction radiation type | MoKα |