Information card for entry 4349899
Formula | C26 H32 Cd N4 O7 |
Calculated formula | C26 H32 Cd N4 O7 |
Title of publication | Efficient heterogeneous catalysis by dual ligand Zn(ii)/Cd(ii) MOFs for the Knoevenagel condensation reaction: adaptable synthetic routes, characterization, crystal structures and luminescence studies |
Authors of publication | Parmar, Bhavesh; Patel, Parth; Murali, Vishnu; Rachuri, Yadagiri; Kureshy, Rukhsana I.; Khan, Noor-ul H.; Suresh, Eringathodi |
Journal of publication | Inorganic Chemistry Frontiers |
Year of publication | 2018 |
Journal volume | 5 |
Journal issue | 10 |
Pages of publication | 2630 |
a | 9.851 ± 0.003 Å |
b | 12.171 ± 0.004 Å |
c | 13.126 ± 0.004 Å |
α | 64.387 ± 0.006° |
β | 68.719 ± 0.006° |
γ | 73.025 ± 0.006° |
Cell volume | 1305.2 ± 0.7 Å3 |
Cell temperature | 150 ± 2 K |
Ambient diffraction temperature | 150 ± 2 K |
Number of distinct elements | 5 |
Space group number | 2 |
Hermann-Mauguin space group symbol | P -1 |
Hall space group symbol | -P 1 |
Residual factor for all reflections | 0.1173 |
Residual factor for significantly intense reflections | 0.0786 |
Weighted residual factors for significantly intense reflections | 0.1366 |
Weighted residual factors for all reflections included in the refinement | 0.1509 |
Goodness-of-fit parameter for all reflections included in the refinement | 1.07 |
Diffraction radiation wavelength | 0.71073 Å |
Diffraction radiation type | MoKα |