Information card for entry 4349900
Formula | C66 H36 N2 O13 Zn4 |
Calculated formula | C66 H36 N2 O13 Zn4 |
Title of publication | Utilizing an effective framework to dye energy transfer in a carbazole-based metal‒organic framework for high performance white light emission tuning |
Authors of publication | Xia, Yu-Pei; Wang, Chen-Xue; An, Lian-Cai; Zhang, Da-Shuai; Hu, Tong-Liang; Xu, Jialiang; Chang, Ze; Bu, Xian-He |
Journal of publication | Inorganic Chemistry Frontiers |
Year of publication | 2018 |
Journal volume | 5 |
Journal issue | 11 |
Pages of publication | 2868 |
a | 26.3989 ± 0.0003 Å |
b | 26.3989 ± 0.0003 Å |
c | 19.2174 ± 0.0003 Å |
α | 90° |
β | 90° |
γ | 90° |
Cell volume | 13392.6 ± 0.3 Å3 |
Cell temperature | 301.7 ± 0.5 K |
Ambient diffraction temperature | 301.7 ± 0.5 K |
Number of distinct elements | 5 |
Space group number | 136 |
Hermann-Mauguin space group symbol | P 42/m n m |
Hall space group symbol | -P 4n 2n |
Residual factor for all reflections | 0.0544 |
Residual factor for significantly intense reflections | 0.0486 |
Weighted residual factors for significantly intense reflections | 0.1503 |
Weighted residual factors for all reflections included in the refinement | 0.1562 |
Goodness-of-fit parameter for all reflections included in the refinement | 1.021 |
Diffraction radiation probe | x-ray |
Diffraction radiation wavelength | 1.54184 Å |
Diffraction radiation type | CuKα |