Information card for entry 4503434
Formula | C22 H19 Cu N4 O4.5 |
Calculated formula | C22 H19 Cu N4 O4.5 |
Title of publication | A Series of Cu(II) Complexes Based on Different Bis(imidazole) Ligands and Organic Acids: Formation of Water Clusters and Fixation of Atmospheric Carbon Dioxide |
Authors of publication | Yang, Jin; Ma, Jian-Fang; Liu, Ying-Ying; Ma, Ji-Cheng; Batten, Stuart R. |
Journal of publication | Crystal Growth & Design |
Year of publication | 2008 |
Journal volume | 8 |
Journal issue | 12 |
Pages of publication | 4383 |
a | 10.081 ± 0.002 Å |
b | 15.983 ± 0.003 Å |
c | 13.27 ± 0.003 Å |
α | 90° |
β | 108.6 ± 0.03° |
γ | 90° |
Cell volume | 2026.4 ± 0.8 Å3 |
Cell temperature | 293 ± 2 K |
Ambient diffraction temperature | 293 ± 2 K |
Number of distinct elements | 5 |
Space group number | 14 |
Hermann-Mauguin space group symbol | P 1 21/n 1 |
Hall space group symbol | -P 2yn |
Residual factor for all reflections | 0.0729 |
Residual factor for significantly intense reflections | 0.0335 |
Weighted residual factors for significantly intense reflections | 0.0451 |
Weighted residual factors for all reflections included in the refinement | 0.0482 |
Goodness-of-fit parameter for all reflections included in the refinement | 0.898 |
Diffraction radiation wavelength | 0.71073 Å |
Diffraction radiation type | MoKα |