Information card for entry 4503435
Formula | C29 H38 Cu N8 O8 |
Calculated formula | C29 H38 Cu N8 O8 |
Title of publication | A Series of Cu(II) Complexes Based on Different Bis(imidazole) Ligands and Organic Acids: Formation of Water Clusters and Fixation of Atmospheric Carbon Dioxide |
Authors of publication | Yang, Jin; Ma, Jian-Fang; Liu, Ying-Ying; Ma, Ji-Cheng; Batten, Stuart R. |
Journal of publication | Crystal Growth & Design |
Year of publication | 2008 |
Journal volume | 8 |
Journal issue | 12 |
Pages of publication | 4383 |
a | 12.245 ± 0.002 Å |
b | 12.559 ± 0.003 Å |
c | 12.983 ± 0.003 Å |
α | 103.75 ± 0.03° |
β | 98.64 ± 0.03° |
γ | 118.67 ± 0.03° |
Cell volume | 1617.7 ± 1 Å3 |
Cell temperature | 293 ± 2 K |
Ambient diffraction temperature | 293 ± 2 K |
Number of distinct elements | 5 |
Space group number | 2 |
Hermann-Mauguin space group symbol | P -1 |
Hall space group symbol | -P 1 |
Residual factor for all reflections | 0.1146 |
Residual factor for significantly intense reflections | 0.05 |
Weighted residual factors for significantly intense reflections | 0.1058 |
Weighted residual factors for all reflections included in the refinement | 0.1211 |
Goodness-of-fit parameter for all reflections included in the refinement | 0.844 |
Diffraction radiation wavelength | 0.71073 Å |
Diffraction radiation type | MoKα |