Information card for entry 4503452
Formula | C48 H42 N4 O14 Zn3 |
Calculated formula | C48 H38 N4 O14 Zn3 |
Title of publication | Effect ofN-Donor Ancillary Ligands on Supramolecular Architectures of a Series of Zinc(II) and Cadmium(II) Complexes with Flexible Tricarboxylate |
Authors of publication | Liu, Guang-Xiang; Huang, Yong-Qing; Chu, Qian; Okamura, Taka-aki; Sun, Wei-Yin; Liang, Hong; Ueyama, Norikazu |
Journal of publication | Crystal Growth & Design |
Year of publication | 2008 |
Journal volume | 8 |
Journal issue | 9 |
Pages of publication | 3233 |
a | 9.6558 ± 0.0012 Å |
b | 9.8429 ± 0.0012 Å |
c | 13.4437 ± 0.0016 Å |
α | 105.134 ± 0.002° |
β | 104.42 ± 0.002° |
γ | 104.882 ± 0.002° |
Cell volume | 1121.5 ± 0.2 Å3 |
Cell temperature | 293 ± 2 K |
Ambient diffraction temperature | 293 ± 2 K |
Number of distinct elements | 5 |
Space group number | 2 |
Hermann-Mauguin space group symbol | P -1 |
Hall space group symbol | -P 1 |
Residual factor for all reflections | 0.101 |
Residual factor for significantly intense reflections | 0.0734 |
Weighted residual factors for significantly intense reflections | 0.1524 |
Weighted residual factors for all reflections included in the refinement | 0.1657 |
Goodness-of-fit parameter for all reflections included in the refinement | 1.089 |
Diffraction radiation wavelength | 0.71073 Å |
Diffraction radiation type | MoKα |