Information card for entry 4503453
Formula | C24 H26 N2 O9 Zn2 |
Calculated formula | C24 H26 N2 O9 Zn2 |
Title of publication | Effect ofN-Donor Ancillary Ligands on Supramolecular Architectures of a Series of Zinc(II) and Cadmium(II) Complexes with Flexible Tricarboxylate |
Authors of publication | Liu, Guang-Xiang; Huang, Yong-Qing; Chu, Qian; Okamura, Taka-aki; Sun, Wei-Yin; Liang, Hong; Ueyama, Norikazu |
Journal of publication | Crystal Growth & Design |
Year of publication | 2008 |
Journal volume | 8 |
Journal issue | 9 |
Pages of publication | 3233 |
a | 10.4037 ± 0.0009 Å |
b | 15.0027 ± 0.0013 Å |
c | 16.842 ± 0.0014 Å |
α | 90° |
β | 106.46 ± 0.002° |
γ | 90° |
Cell volume | 2521 ± 0.4 Å3 |
Cell temperature | 293 ± 2 K |
Ambient diffraction temperature | 293 ± 2 K |
Number of distinct elements | 5 |
Space group number | 14 |
Hermann-Mauguin space group symbol | P 1 21/c 1 |
Hall space group symbol | -P 2ybc |
Residual factor for all reflections | 0.0406 |
Residual factor for significantly intense reflections | 0.0332 |
Weighted residual factors for significantly intense reflections | 0.0895 |
Weighted residual factors for all reflections included in the refinement | 0.0924 |
Goodness-of-fit parameter for all reflections included in the refinement | 1.07 |
Diffraction radiation wavelength | 0.71073 Å |
Diffraction radiation type | MoKα |