Information card for entry 4503477
Formula | C42 H66 Ag6 F36 N12 O36 S12 |
Calculated formula | C42 H66 Ag6 F36 N12 O36 S12 |
Title of publication | Polynuclear Metal Complexes Obtained from the Task-Specific Ionic Liquid Betainium Bistriflimide |
Authors of publication | Nockemann, Peter; Thijs, Ben; Hecke, Kristof Van; Meervelt, Luc Van; Binnemans, Koen |
Journal of publication | Crystal Growth & Design |
Year of publication | 2008 |
Journal volume | 8 |
Journal issue | 4 |
Pages of publication | 1353 |
a | 15.1684 ± 0.0004 Å |
b | 28.3635 ± 0.0006 Å |
c | 23.0544 ± 0.0006 Å |
α | 90° |
β | 106.297 ± 0.002° |
γ | 90° |
Cell volume | 9520.1 ± 0.4 Å3 |
Cell temperature | 100 ± 2 K |
Ambient diffraction temperature | 100 ± 2 K |
Number of distinct elements | 7 |
Space group number | 14 |
Hermann-Mauguin space group symbol | P 1 21/n 1 |
Hall space group symbol | -P 2yn |
Residual factor for all reflections | 0.0881 |
Residual factor for significantly intense reflections | 0.0571 |
Weighted residual factors for significantly intense reflections | 0.1288 |
Weighted residual factors for all reflections included in the refinement | 0.1522 |
Goodness-of-fit parameter for all reflections included in the refinement | 0.92 |
Diffraction radiation wavelength | 1.54178 Å |
Diffraction radiation type | CuKα |