Information card for entry 4503478
Formula | C109 H180 F84 N30 O94 Pb10 S28 |
Calculated formula | C109 H180 F84 N30 O94 Pb10 S28 |
Title of publication | Polynuclear Metal Complexes Obtained from the Task-Specific Ionic Liquid Betainium Bistriflimide |
Authors of publication | Nockemann, Peter; Thijs, Ben; Hecke, Kristof Van; Meervelt, Luc Van; Binnemans, Koen |
Journal of publication | Crystal Growth & Design |
Year of publication | 2008 |
Journal volume | 8 |
Journal issue | 4 |
Pages of publication | 1353 |
a | 14.3771 ± 0.0014 Å |
b | 14.6422 ± 0.0015 Å |
c | 28.123 ± 0.004 Å |
α | 88.758 ± 0.006° |
β | 88.222 ± 0.006° |
γ | 85.688 ± 0.005° |
Cell volume | 5899.5 ± 1.2 Å3 |
Cell temperature | 100 ± 2 K |
Ambient diffraction temperature | 100 ± 2 K |
Number of distinct elements | 7 |
Space group number | 2 |
Hermann-Mauguin space group symbol | P -1 |
Hall space group symbol | -P 1 |
Residual factor for all reflections | 0.1243 |
Residual factor for significantly intense reflections | 0.0775 |
Weighted residual factors for significantly intense reflections | 0.1737 |
Weighted residual factors for all reflections included in the refinement | 0.2009 |
Goodness-of-fit parameter for all reflections included in the refinement | 1.014 |
Diffraction radiation wavelength | 1.54178 Å |
Diffraction radiation type | CuKα |