Information card for entry 4503756
Formula | C16 H12 Cl4 Mn O10 |
Calculated formula | C16 H20 Cl4 Mn O10 |
Title of publication | Solvent-Controlled Assembly of Manganese(II) Tetrachloroterephthalates with 1D Chain, 2D Layer, and 3D Coordination Architectures |
Authors of publication | Chen, Sheng-Chun; Zhang, Zhi-Hui; Huang, Kun-Lin; Chen, Qun; He, Ming-Yang; Cui, Ai-Jun; Li, Chao; Liu, Qi; Du, Miao |
Journal of publication | Crystal Growth & Design |
Year of publication | 2008 |
Journal volume | 8 |
Journal issue | 9 |
Pages of publication | 3437 |
a | 7.5474 ± 0.001 Å |
b | 7.7557 ± 0.001 Å |
c | 10.2307 ± 0.0013 Å |
α | 77.722 ± 0.001° |
β | 77.731 ± 0.001° |
γ | 72.166 ± 0.001° |
Cell volume | 550.01 ± 0.12 Å3 |
Cell temperature | 296 ± 2 K |
Ambient diffraction temperature | 296 ± 2 K |
Number of distinct elements | 5 |
Space group number | 2 |
Hermann-Mauguin space group symbol | P -1 |
Hall space group symbol | -P 1 |
Residual factor for all reflections | 0.0365 |
Residual factor for significantly intense reflections | 0.033 |
Weighted residual factors for significantly intense reflections | 0.0895 |
Weighted residual factors for all reflections included in the refinement | 0.1035 |
Goodness-of-fit parameter for all reflections included in the refinement | 1.003 |
Diffraction radiation wavelength | 0.71073 Å |
Diffraction radiation type | MoKα |