Information card for entry 4503757
Formula | C55 H35 Cl20 Mn5 N5 O25 |
Calculated formula | C55 H35 Cl20 Mn5 N5 O25 |
Title of publication | Solvent-Controlled Assembly of Manganese(II) Tetrachloroterephthalates with 1D Chain, 2D Layer, and 3D Coordination Architectures |
Authors of publication | Chen, Sheng-Chun; Zhang, Zhi-Hui; Huang, Kun-Lin; Chen, Qun; He, Ming-Yang; Cui, Ai-Jun; Li, Chao; Liu, Qi; Du, Miao |
Journal of publication | Crystal Growth & Design |
Year of publication | 2008 |
Journal volume | 8 |
Journal issue | 9 |
Pages of publication | 3437 |
a | 17.772 ± 0.005 Å |
b | 36.874 ± 0.01 Å |
c | 12.641 ± 0.004 Å |
α | 90° |
β | 90° |
γ | 90° |
Cell volume | 8284 ± 4 Å3 |
Cell temperature | 291 ± 2 K |
Ambient diffraction temperature | 291 ± 2 K |
Number of distinct elements | 6 |
Space group number | 74 |
Hermann-Mauguin space group symbol | I m m a |
Hall space group symbol | -I 2b 2 |
Residual factor for all reflections | 0.0978 |
Residual factor for significantly intense reflections | 0.0557 |
Weighted residual factors for significantly intense reflections | 0.1104 |
Weighted residual factors for all reflections included in the refinement | 0.1188 |
Goodness-of-fit parameter for all reflections included in the refinement | 1.077 |
Diffraction radiation wavelength | 0.71073 Å |
Diffraction radiation type | MoKα |