Information card for entry 4503875
Formula | H4 O9 P2 V |
Calculated formula | H4 O9 P2 V |
Title of publication | Oxo-vanadium(IV) dihydrogen phosphate: preparation, magnetic study, and heterogeneous catalytic epoxidation. |
Authors of publication | Sen, Rupam; Bera, Rajesh; Bhattacharjee, Ashis; Gütlich, Philipp; Ghosh, Soumen; Mukherjee, Alok K.; Koner, Subratanath |
Journal of publication | Langmuir : the ACS journal of surfaces and colloids |
Year of publication | 2008 |
Journal volume | 24 |
Journal issue | 11 |
Pages of publication | 5970 - 5975 |
a | 8.9632 ± 0.0004 Å |
b | 8.9632 ± 0.0004 Å |
c | 7.977 ± 0.003 Å |
α | 90° |
β | 90° |
γ | 90° |
Cell volume | 640.9 ± 0.2 Å3 |
Cell temperature | 293 ± 2 K |
Ambient diffraction temperature | 293 ± 2 K |
Number of distinct elements | 4 |
Space group number | 130 |
Hermann-Mauguin space group symbol | P 4/n c c :2 |
Hall space group symbol | -P 4a 2ac |
Residual factor for all reflections | 0.0544 |
Residual factor for significantly intense reflections | 0.0497 |
Weighted residual factors for significantly intense reflections | 0.1158 |
Weighted residual factors for all reflections included in the refinement | 0.1186 |
Goodness-of-fit parameter for all reflections included in the refinement | 1.166 |
Diffraction radiation wavelength | 0.71073 Å |
Diffraction radiation type | MoKα |