Information card for entry 4503876
Formula | C50 H92 Br2 O2 P4 Pt2 |
Calculated formula | C50 H92 Br2 O2 P4 Pt2 |
Title of publication | Giant micelles of organoplatinum(II) gemini amphiphiles. |
Authors of publication | Maran, Umamageswaran; Conley, Hiram; Frank, Markus; Arif, Atta M.; Orendt, Anita M.; Britt, David; Hlady, Vladimir; Davis, Robert; Stang, Peter J. |
Journal of publication | Langmuir : the ACS journal of surfaces and colloids |
Year of publication | 2008 |
Journal volume | 24 |
Journal issue | 10 |
Pages of publication | 5400 - 5410 |
a | 13.8359 ± 0.0003 Å |
b | 13.9322 ± 0.0002 Å |
c | 30.3691 ± 0.0005 Å |
α | 90° |
β | 90° |
γ | 90° |
Cell volume | 5854.09 ± 0.18 Å3 |
Cell temperature | 150 ± 1 K |
Ambient diffraction temperature | 150 ± 1 K |
Number of distinct elements | 6 |
Space group number | 19 |
Hermann-Mauguin space group symbol | P 21 21 21 |
Hall space group symbol | P 2ac 2ab |
Residual factor for all reflections | 0.0683 |
Residual factor for significantly intense reflections | 0.0439 |
Weighted residual factors for significantly intense reflections | 0.0881 |
Weighted residual factors for all reflections included in the refinement | 0.0996 |
Goodness-of-fit parameter for all reflections included in the refinement | 1.018 |
Diffraction radiation wavelength | 0.71073 Å |
Diffraction radiation type | MoKα |