Information card for entry 4504330
Formula | C72 H50 N8 O17 Zn2 |
Calculated formula | C72 H48 N8 O17 Zn2 |
Title of publication | Ligand and pH-Controlled ZnIIBilayer Coordination Polymers Based on Biphenyl-3,3‘,4,4‘-tetracarboxylate |
Authors of publication | Wang, Ji-Jiang; Gou, Lei; Hu, Huai-Ming; Han, Zhong-Xi; Li, Dong-Sheng; Xue, Gang-Lin; Yang, Meng-Lin; Shi, Qi-Zhen |
Journal of publication | Crystal Growth & Design |
Year of publication | 2007 |
Journal volume | 7 |
Journal issue | 8 |
Pages of publication | 1514 |
a | 12.0568 ± 0.0019 Å |
b | 24.049 ± 0.004 Å |
c | 10.6693 ± 0.0017 Å |
α | 90° |
β | 105.964 ± 0.002° |
γ | 90° |
Cell volume | 2974.3 ± 0.8 Å3 |
Cell temperature | 296 ± 2 K |
Ambient diffraction temperature | 296 ± 2 K |
Number of distinct elements | 5 |
Space group number | 14 |
Hermann-Mauguin space group symbol | P 1 21/c 1 |
Hall space group symbol | -P 2ybc |
Residual factor for all reflections | 0.0573 |
Residual factor for significantly intense reflections | 0.0383 |
Weighted residual factors for significantly intense reflections | 0.0864 |
Weighted residual factors for all reflections included in the refinement | 0.0963 |
Goodness-of-fit parameter for all reflections included in the refinement | 1.043 |
Diffraction radiation wavelength | 0.71073 Å |
Diffraction radiation type | MoKα |