Information card for entry 4504331
Formula | C28 H20 N2 O8 Zn |
Calculated formula | C28 H20 N2 O8 Zn |
Title of publication | Ligand and pH-Controlled ZnIIBilayer Coordination Polymers Based on Biphenyl-3,3‘,4,4‘-tetracarboxylate |
Authors of publication | Wang, Ji-Jiang; Gou, Lei; Hu, Huai-Ming; Han, Zhong-Xi; Li, Dong-Sheng; Xue, Gang-Lin; Yang, Meng-Lin; Shi, Qi-Zhen |
Journal of publication | Crystal Growth & Design |
Year of publication | 2007 |
Journal volume | 7 |
Journal issue | 8 |
Pages of publication | 1514 |
a | 9.2671 ± 0.0017 Å |
b | 10.8252 ± 0.0019 Å |
c | 12.39 ± 0.002 Å |
α | 97.306 ± 0.002° |
β | 106.614 ± 0.002° |
γ | 93.547 ± 0.002° |
Cell volume | 1175.1 ± 0.4 Å3 |
Cell temperature | 296 ± 2 K |
Ambient diffraction temperature | 296 ± 2 K |
Number of distinct elements | 5 |
Space group number | 2 |
Hermann-Mauguin space group symbol | P -1 |
Hall space group symbol | -P 1 |
Residual factor for all reflections | 0.1429 |
Residual factor for significantly intense reflections | 0.0674 |
Weighted residual factors for significantly intense reflections | 0.1123 |
Weighted residual factors for all reflections included in the refinement | 0.1395 |
Goodness-of-fit parameter for all reflections included in the refinement | 0.996 |
Diffraction radiation wavelength | 0.71073 Å |
Diffraction radiation type | MoKα |