Information card for entry 4504344
Formula | C20 H20 Co N3 O7 |
Calculated formula | C20 H20 Co N3 O7 |
Title of publication | Organic‒Inorganic Hybrid Coordination Polymers Based on 6-Methylpyridine-2,4-dicarboxylic Acid N-Oxide (MPDCO) Ligand: Preparations, Interpenetrating Structures, and Magnetic and Luminescent Properties |
Authors of publication | Lin, Jian-Guo; Su, Yang; Tian, Zheng-Fang; Qiu, Ling; Wen, Li-Li; Lu, Zhen-Da; Li, Yi-Zhi; Meng, Qing-Jin |
Journal of publication | Crystal Growth & Design |
Year of publication | 2007 |
Journal volume | 7 |
Journal issue | 12 |
Pages of publication | 2526 |
a | 18.867 ± 0.003 Å |
b | 13.511 ± 0.002 Å |
c | 16.415 ± 0.003 Å |
α | 90° |
β | 106.892 ± 0.004° |
γ | 90° |
Cell volume | 4003.8 ± 1.1 Å3 |
Cell temperature | 298 ± 2 K |
Ambient diffraction temperature | 298 ± 2 K |
Number of distinct elements | 5 |
Space group number | 15 |
Hermann-Mauguin space group symbol | C 1 2/c 1 |
Hall space group symbol | -C 2yc |
Residual factor for all reflections | 0.0804 |
Residual factor for significantly intense reflections | 0.0534 |
Weighted residual factors for significantly intense reflections | 0.1168 |
Weighted residual factors for all reflections included in the refinement | 0.123 |
Goodness-of-fit parameter for all reflections included in the refinement | 1.098 |
Diffraction radiation wavelength | 0.71073 Å |
Diffraction radiation type | MoKα |