Information card for entry 4504345
Formula | C20 H20.75 N3 Ni O7.375 |
Calculated formula | C20 H20.75 N3 Ni O7.375 |
Title of publication | Organic‒Inorganic Hybrid Coordination Polymers Based on 6-Methylpyridine-2,4-dicarboxylic Acid N-Oxide (MPDCO) Ligand: Preparations, Interpenetrating Structures, and Magnetic and Luminescent Properties |
Authors of publication | Lin, Jian-Guo; Su, Yang; Tian, Zheng-Fang; Qiu, Ling; Wen, Li-Li; Lu, Zhen-Da; Li, Yi-Zhi; Meng, Qing-Jin |
Journal of publication | Crystal Growth & Design |
Year of publication | 2007 |
Journal volume | 7 |
Journal issue | 12 |
Pages of publication | 2526 |
a | 19.073 ± 0.004 Å |
b | 13.329 ± 0.003 Å |
c | 16.272 ± 0.004 Å |
α | 90° |
β | 107.395 ± 0.005° |
γ | 90° |
Cell volume | 3947.5 ± 1.6 Å3 |
Cell temperature | 293 ± 2 K |
Ambient diffraction temperature | 293 ± 2 K |
Number of distinct elements | 5 |
Space group number | 15 |
Hermann-Mauguin space group symbol | C 1 2/c 1 |
Hall space group symbol | -C 2yc |
Residual factor for all reflections | 0.057 |
Residual factor for significantly intense reflections | 0.039 |
Weighted residual factors for significantly intense reflections | 0.0884 |
Weighted residual factors for all reflections included in the refinement | 0.0935 |
Goodness-of-fit parameter for all reflections included in the refinement | 1.014 |
Diffraction radiation wavelength | 0.71073 Å |
Diffraction radiation type | MoKα |