Information card for entry 4504346
Formula | C20 H22 N3 O8 Zn |
Calculated formula | C20 H22 N3 O8 Zn |
Title of publication | Organic‒Inorganic Hybrid Coordination Polymers Based on 6-Methylpyridine-2,4-dicarboxylic Acid N-Oxide (MPDCO) Ligand: Preparations, Interpenetrating Structures, and Magnetic and Luminescent Properties |
Authors of publication | Lin, Jian-Guo; Su, Yang; Tian, Zheng-Fang; Qiu, Ling; Wen, Li-Li; Lu, Zhen-Da; Li, Yi-Zhi; Meng, Qing-Jin |
Journal of publication | Crystal Growth & Design |
Year of publication | 2007 |
Journal volume | 7 |
Journal issue | 12 |
Pages of publication | 2526 |
a | 19.437 ± 0.002 Å |
b | 13.4396 ± 0.0015 Å |
c | 16.7213 ± 0.0019 Å |
α | 90° |
β | 106.056 ± 0.002° |
γ | 90° |
Cell volume | 4197.6 ± 0.8 Å3 |
Cell temperature | 293 ± 2 K |
Ambient diffraction temperature | 293 ± 2 K |
Number of distinct elements | 5 |
Space group number | 15 |
Hermann-Mauguin space group symbol | C 1 2/c 1 |
Hall space group symbol | -C 2yc |
Residual factor for all reflections | 0.0782 |
Residual factor for significantly intense reflections | 0.05 |
Weighted residual factors for significantly intense reflections | 0.1092 |
Weighted residual factors for all reflections included in the refinement | 0.1165 |
Goodness-of-fit parameter for all reflections included in the refinement | 1.041 |
Diffraction radiation wavelength | 0.71073 Å |
Diffraction radiation type | MoKα |