Information card for entry 4504445
Formula | C6 H4 Cu2 N2 S2 |
Calculated formula | C6 H4 Cu2 N2 S2 |
Title of publication | Construction of Pyridinethiolate-Bridged 2D and 3D Coordination Networks of d10Metal Halides via Solvothermalin SituDisulfide Cleavage Reactions |
Authors of publication | Wang, Jing; Zhang, Yue-Hua; Li, Hao-Xiang; Lin, Zhuo-Jia; Tong, Ming-Liang |
Journal of publication | Crystal Growth & Design |
Year of publication | 2007 |
Journal volume | 7 |
Journal issue | 11 |
Pages of publication | 2352 |
a | 7.3433 ± 0.0013 Å |
b | 8.5921 ± 0.0015 Å |
c | 12.889 ± 0.002 Å |
α | 90° |
β | 90° |
γ | 90° |
Cell volume | 813.2 ± 0.2 Å3 |
Cell temperature | 293 ± 2 K |
Ambient diffraction temperature | 293 ± 2 K |
Number of distinct elements | 5 |
Space group number | 40 |
Hermann-Mauguin space group symbol | A m a 2 |
Hall space group symbol | A 2 -2a |
Residual factor for all reflections | 0.0206 |
Residual factor for significantly intense reflections | 0.0204 |
Weighted residual factors for significantly intense reflections | 0.0483 |
Weighted residual factors for all reflections included in the refinement | 0.0484 |
Goodness-of-fit parameter for all reflections included in the refinement | 1.096 |
Diffraction radiation wavelength | 0.71073 Å |
Diffraction radiation type | MoKα |