Information card for entry 4504446
Formula | C5 H5 Ag2 Cl2 N S |
Calculated formula | C5 H5 Ag2 Cl2 N S |
Title of publication | Construction of Pyridinethiolate-Bridged 2D and 3D Coordination Networks of d10Metal Halides via Solvothermalin SituDisulfide Cleavage Reactions |
Authors of publication | Wang, Jing; Zhang, Yue-Hua; Li, Hao-Xiang; Lin, Zhuo-Jia; Tong, Ming-Liang |
Journal of publication | Crystal Growth & Design |
Year of publication | 2007 |
Journal volume | 7 |
Journal issue | 11 |
Pages of publication | 2352 |
a | 4.2314 ± 0.0008 Å |
b | 10.732 ± 0.002 Å |
c | 18.842 ± 0.004 Å |
α | 90° |
β | 91.697 ± 0.004° |
γ | 90° |
Cell volume | 855.3 ± 0.3 Å3 |
Cell temperature | 293 ± 2 K |
Ambient diffraction temperature | 293 ± 2 K |
Number of distinct elements | 6 |
Space group number | 14 |
Hermann-Mauguin space group symbol | P 1 21/c 1 |
Hall space group symbol | -P 2ybc |
Residual factor for all reflections | 0.0618 |
Residual factor for significantly intense reflections | 0.0573 |
Weighted residual factors for significantly intense reflections | 0.1298 |
Weighted residual factors for all reflections included in the refinement | 0.133 |
Goodness-of-fit parameter for all reflections included in the refinement | 1.026 |
Diffraction radiation wavelength | 0.71073 Å |
Diffraction radiation type | MoKα |