Information card for entry 4509138
Formula | C11 H16 Br2 N4 Zn |
Calculated formula | C11 H16 Br2 N4 Zn |
Title of publication | Influence of Anion on the Coordination Mode of a Flexible Neutral Ligand in Zn(II) Complexes: From Discrete Zero-Dimensional to Infinite 1D Helical Chains, 2D Nanoporous Bilayer Networks, and 3D Interpenetrated Metal−Organic Frameworks |
Authors of publication | Mondal, Raju; Basu, Tannistha; Sadhukhan, Dipali; Chattopadhyay, Tanmay; Bhunia, Manas kumar |
Journal of publication | Crystal Growth & Design |
Year of publication | 2009 |
Journal volume | 9 |
Journal issue | 2 |
Pages of publication | 1095 |
a | 9.5574 ± 0.0002 Å |
b | 8.7122 ± 0.0002 Å |
c | 18.1866 ± 0.0003 Å |
α | 90° |
β | 100.459 ± 0.001° |
γ | 90° |
Cell volume | 1489.16 ± 0.05 Å3 |
Cell temperature | 120 ± 2 K |
Ambient diffraction temperature | 120 ± 2 K |
Number of distinct elements | 5 |
Space group number | 14 |
Hermann-Mauguin space group symbol | P 1 21/n 1 |
Hall space group symbol | -P 2yn |
Residual factor for all reflections | 0.0629 |
Residual factor for significantly intense reflections | 0.0321 |
Weighted residual factors for significantly intense reflections | 0.064 |
Weighted residual factors for all reflections included in the refinement | 0.0718 |
Goodness-of-fit parameter for all reflections included in the refinement | 0.994 |
Diffraction radiation wavelength | 0.71073 Å |
Diffraction radiation type | MoKα |