Information card for entry 4509139
Formula | C22 H32 N10 O6 Zn |
Calculated formula | C22 H32 N10 O6 Zn |
Title of publication | Influence of Anion on the Coordination Mode of a Flexible Neutral Ligand in Zn(II) Complexes: From Discrete Zero-Dimensional to Infinite 1D Helical Chains, 2D Nanoporous Bilayer Networks, and 3D Interpenetrated Metal−Organic Frameworks |
Authors of publication | Mondal, Raju; Basu, Tannistha; Sadhukhan, Dipali; Chattopadhyay, Tanmay; Bhunia, Manas kumar |
Journal of publication | Crystal Growth & Design |
Year of publication | 2009 |
Journal volume | 9 |
Journal issue | 2 |
Pages of publication | 1095 |
a | 13.4139 ± 0.0007 Å |
b | 13.4139 ± 0.0007 Å |
c | 31.309 ± 0.003 Å |
α | 90° |
β | 90° |
γ | 90° |
Cell volume | 5633.5 ± 0.7 Å3 |
Cell temperature | 120 ± 2 K |
Ambient diffraction temperature | 120 ± 2 K |
Number of distinct elements | 5 |
Space group number | 142 |
Hermann-Mauguin space group symbol | I 41/a c d :2 |
Hall space group symbol | -I 4bd 2c |
Residual factor for all reflections | 0.0369 |
Residual factor for significantly intense reflections | 0.0297 |
Weighted residual factors for significantly intense reflections | 0.078 |
Weighted residual factors for all reflections included in the refinement | 0.0838 |
Goodness-of-fit parameter for all reflections included in the refinement | 1.092 |
Diffraction radiation wavelength | 0.71073 Å |
Diffraction radiation type | MoKα |