Information card for entry 4511259
Formula | C22 H30 Co N2 O13 |
Calculated formula | C22 H30 Co N2 O13 |
Title of publication | Syntheses, Crystal Structures, and Magnetic Properties of Metal‒Organic Hybrid Materials of Mn(II)/Co(II): Three-Fold Interpenetrated α-Polonium-like Network in One of Them |
Authors of publication | Mistri, Soumen; Zangrando, Ennio; Figuerola, Albert; Adhikary, Amit; Konar, Sanjit; Cano, Joan; Manna, Subal Chandra |
Journal of publication | Crystal Growth & Design |
Year of publication | 2014 |
Journal volume | 14 |
Journal issue | 7 |
Pages of publication | 3276 |
a | 7.5539 ± 0.0009 Å |
b | 8.4979 ± 0.0008 Å |
c | 20.6375 ± 0.0012 Å |
α | 87.947 ± 0.011° |
β | 83.923 ± 0.01° |
γ | 72.251 ± 0.012° |
Cell volume | 1254.6 ± 0.2 Å3 |
Cell temperature | 296 ± 2 K |
Ambient diffraction temperature | 296 ± 2 K |
Number of distinct elements | 5 |
Space group number | 2 |
Hermann-Mauguin space group symbol | P -1 |
Hall space group symbol | -P 1 |
Residual factor for all reflections | 0.0415 |
Residual factor for significantly intense reflections | 0.0355 |
Weighted residual factors for significantly intense reflections | 0.1066 |
Weighted residual factors for all reflections included in the refinement | 0.1111 |
Goodness-of-fit parameter for all reflections included in the refinement | 1.071 |
Diffraction radiation wavelength | 0.71073 Å |
Diffraction radiation type | MoKα |