Information card for entry 4511260
Formula | C24 H21 Co N2 O4.5 |
Calculated formula | C24.012 H20 Co N2 O4.5 |
Title of publication | Syntheses, Crystal Structures, and Magnetic Properties of Metal‒Organic Hybrid Materials of Mn(II)/Co(II): Three-Fold Interpenetrated α-Polonium-like Network in One of Them |
Authors of publication | Mistri, Soumen; Zangrando, Ennio; Figuerola, Albert; Adhikary, Amit; Konar, Sanjit; Cano, Joan; Manna, Subal Chandra |
Journal of publication | Crystal Growth & Design |
Year of publication | 2014 |
Journal volume | 14 |
Journal issue | 7 |
Pages of publication | 3276 |
a | 9.721 ± 0.001 Å |
b | 10.9804 ± 0.0018 Å |
c | 11.479 ± 0.002 Å |
α | 97.966 ± 0.01° |
β | 96.212 ± 0.011° |
γ | 98.244 ± 0.013° |
Cell volume | 1190.6 ± 0.3 Å3 |
Cell temperature | 293 ± 2 K |
Ambient diffraction temperature | 293 ± 2 K |
Number of distinct elements | 5 |
Space group number | 2 |
Hermann-Mauguin space group symbol | P -1 |
Hall space group symbol | -P 1 |
Residual factor for all reflections | 0.1069 |
Residual factor for significantly intense reflections | 0.0626 |
Weighted residual factors for significantly intense reflections | 0.1634 |
Weighted residual factors for all reflections included in the refinement | 0.1855 |
Goodness-of-fit parameter for all reflections included in the refinement | 0.975 |
Diffraction radiation wavelength | 0.71073 Å |
Diffraction radiation type | MoKα |