Information card for entry 4514565
Formula | C24 H24 Cl3 Cu18 N36 O42 P W12 |
Calculated formula | C24 H24 Cl3 Cu18 N36 O42 P W12 |
Title of publication | POMOF/SWNT Nanocomposites with Prominent Peroxidase-Mimicking Activity for l-Cysteine "On-Off Switch" Colorimetric Biosensing. |
Authors of publication | Li, Xiao; Yang, Xi-Ya; Sha, Jing-Quan; Han, Tao; Du, Chun-Jiang; Sun, Yuan-Jie; Lan, Ya-Qian |
Journal of publication | ACS applied materials & interfaces |
Year of publication | 2019 |
Journal volume | 11 |
Journal issue | 18 |
Pages of publication | 16896 - 16904 |
a | 20.8861 ± 0.0013 Å |
b | 20.5655 ± 0.0013 Å |
c | 20.678 ± 0.0014 Å |
α | 90° |
β | 113.811 ± 0.001° |
γ | 90° |
Cell volume | 8125.9 ± 0.9 Å3 |
Cell temperature | 296 ± 2 K |
Ambient diffraction temperature | 296 ± 2 K |
Number of distinct elements | 8 |
Space group number | 15 |
Hermann-Mauguin space group symbol | C 1 2/c 1 |
Hall space group symbol | -C 2yc |
Residual factor for all reflections | 0.1057 |
Residual factor for significantly intense reflections | 0.0609 |
Weighted residual factors for significantly intense reflections | 0.1504 |
Weighted residual factors for all reflections included in the refinement | 0.1768 |
Goodness-of-fit parameter for all reflections included in the refinement | 1.009 |
Diffraction radiation wavelength | 0.71073 Å |
Diffraction radiation type | MoKα |