Information card for entry 4514566
Formula | C16 H16 Cl2 Cu6 N24 O44 P W12 |
Calculated formula | C16 H16 Cl2 Cu6 N24 O44 P W12 |
Title of publication | POMOF/SWNT Nanocomposites with Prominent Peroxidase-Mimicking Activity for l-Cysteine "On-Off Switch" Colorimetric Biosensing. |
Authors of publication | Li, Xiao; Yang, Xi-Ya; Sha, Jing-Quan; Han, Tao; Du, Chun-Jiang; Sun, Yuan-Jie; Lan, Ya-Qian |
Journal of publication | ACS applied materials & interfaces |
Year of publication | 2019 |
Journal volume | 11 |
Journal issue | 18 |
Pages of publication | 16896 - 16904 |
a | 11.516 ± 0.003 Å |
b | 12.049 ± 0.003 Å |
c | 14.257 ± 0.004 Å |
α | 94.053 ± 0.004° |
β | 105.889 ± 0.004° |
γ | 106.155 ± 0.004° |
Cell volume | 1804.3 ± 0.8 Å3 |
Cell temperature | 296 ± 2 K |
Ambient diffraction temperature | 296.15 K |
Number of distinct elements | 8 |
Space group number | 2 |
Hermann-Mauguin space group symbol | P -1 |
Hall space group symbol | -P 1 |
Residual factor for all reflections | 0.0886 |
Residual factor for significantly intense reflections | 0.075 |
Weighted residual factors for significantly intense reflections | 0.1892 |
Weighted residual factors for all reflections included in the refinement | 0.2007 |
Goodness-of-fit parameter for all reflections included in the refinement | 1.054 |
Diffraction radiation wavelength | 0.71073 Å |
Diffraction radiation type | MoKα |