Information card for entry 4514567
Formula | C11 H7 In0.5 N0.5 O2.67 |
Calculated formula | C11 H6 In0.5 N0.5 O2.66667 |
Title of publication | Enhancement of Intrinsic Proton Conductivity and Aniline Sensitivity by Introducing Dye Molecules into the MOF Channel. |
Authors of publication | Liu, Lizhen; Yao, Zizhu; Ye, Yingxiang; Liu, Chulong; Lin, Quanjie; Chen, Shimin; Xiang, Shengchang; Zhang, Zhangjing |
Journal of publication | ACS applied materials & interfaces |
Year of publication | 2019 |
Journal volume | 11 |
Journal issue | 18 |
Pages of publication | 16490 - 16495 |
a | 36.5584 ± 0.0003 Å |
b | 36.5584 ± 0.0003 Å |
c | 36.5584 ± 0.0003 Å |
α | 90° |
β | 90° |
γ | 90° |
Cell volume | 48860.9 ± 0.7 Å3 |
Cell temperature | 292.98 ± 0.1 K |
Ambient diffraction temperature | 292.98 ± 0.1 K |
Number of distinct elements | 5 |
Space group number | 223 |
Hermann-Mauguin space group symbol | P m -3 n |
Hall space group symbol | -P 4n 2 3 |
Residual factor for all reflections | 0.064 |
Residual factor for significantly intense reflections | 0.0458 |
Weighted residual factors for significantly intense reflections | 0.1276 |
Weighted residual factors for all reflections included in the refinement | 0.1399 |
Goodness-of-fit parameter for all reflections included in the refinement | 0.969 |
Diffraction radiation probe | x-ray |
Diffraction radiation wavelength | 1.54184 Å |
Diffraction radiation type | CuKα |