Information card for entry 4515753
Formula | C46 H40 O5 |
Calculated formula | C46 H40 O5 |
Title of publication | N-Arylpyridiniophosphines: Synthesis, Structure, and Applications in Au(I) Catalysis |
Authors of publication | Tinnermann, Hendrik; Nicholls, Leo D. M.; Johannsen, Tim; Wille, Christian; Golz, Christopher; Goddard, Richard; Alcarazo, Manuel |
Journal of publication | ACS Catalysis |
Year of publication | 2018 |
Journal volume | 8 |
Journal issue | 11 |
Pages of publication | 10457 |
a | 11.0227 ± 0.0008 Å |
b | 11.4514 ± 0.0009 Å |
c | 15.2564 ± 0.0011 Å |
α | 69.58 ± 0.003° |
β | 76.609 ± 0.003° |
γ | 74.008 ± 0.002° |
Cell volume | 1715.2 ± 0.2 Å3 |
Cell temperature | 100 K |
Ambient diffraction temperature | 100 K |
Number of distinct elements | 3 |
Space group number | 2 |
Hermann-Mauguin space group symbol | P -1 |
Hall space group symbol | -P 1 |
Residual factor for all reflections | 0.0551 |
Residual factor for significantly intense reflections | 0.0487 |
Weighted residual factors for significantly intense reflections | 0.1324 |
Weighted residual factors for all reflections included in the refinement | 0.1379 |
Goodness-of-fit parameter for all reflections included in the refinement | 1.043 |
Diffraction radiation wavelength | 0.71073 Å |
Diffraction radiation type | MoKα |