Information card for entry 4515810
Formula | C28 H35 Cl5 N2 O2 W |
Calculated formula | C28 H35 Cl5 N2 O2 W |
SMILES | [W]1(Cl)(Cl)([O](C)CC[O]1C)(=Nc1c(Cl)cc(Cl)cc1Cl)=Nc1c(cccc1C(C)C)C(C)C.c1ccccc1 |
Title of publication | Bis(Imido) Tungsten Complexes: Efficient Precatalysts for the Homogeneous Dimerization of Ethylene |
Authors of publication | Messinis, Antonis M.; Batsanov, Andrei S.; Wright, William R. H.; Howard, Judith A. K.; Hanton, Martin J.; Dyer, Philip W. |
Journal of publication | ACS Catalysis |
Year of publication | 2018 |
Journal volume | 8 |
Journal issue | 12 |
Pages of publication | 11249 |
a | 12.1544 ± 0.0012 Å |
b | 10.4027 ± 0.0011 Å |
c | 24.447 ± 0.002 Å |
α | 90° |
β | 91.001 ± 0.009° |
γ | 90° |
Cell volume | 3090.6 ± 0.5 Å3 |
Cell temperature | 120 K |
Ambient diffraction temperature | 120 K |
Number of distinct elements | 6 |
Space group number | 14 |
Hermann-Mauguin space group symbol | P 1 21/c 1 |
Hall space group symbol | -P 2ybc |
Residual factor for all reflections | 0.0202 |
Residual factor for significantly intense reflections | 0.018 |
Weighted residual factors for significantly intense reflections | 0.0387 |
Weighted residual factors for all reflections included in the refinement | 0.0396 |
Goodness-of-fit parameter for all reflections included in the refinement | 1.052 |
Diffraction radiation probe | x-ray |
Diffraction radiation wavelength | 0.71073 Å |
Diffraction radiation type | MoKα |