Information card for entry 4515811
Formula | C22 H29 Cl2 F3 N2 O2 W |
Calculated formula | C22 H29 Cl2 F3 N2 O2 W |
SMILES | [W]1(Cl)(Cl)([O](C)CC[O]1C)(=Nc1c(F)cc(F)cc1F)=Nc1c(cccc1C(C)C)C(C)C |
Title of publication | Bis(Imido) Tungsten Complexes: Efficient Precatalysts for the Homogeneous Dimerization of Ethylene |
Authors of publication | Messinis, Antonis M.; Batsanov, Andrei S.; Wright, William R. H.; Howard, Judith A. K.; Hanton, Martin J.; Dyer, Philip W. |
Journal of publication | ACS Catalysis |
Year of publication | 2018 |
Journal volume | 8 |
Journal issue | 12 |
Pages of publication | 11249 |
a | 8.8303 ± 0.0005 Å |
b | 11.5526 ± 0.0006 Å |
c | 12.8453 ± 0.0007 Å |
α | 77.061 ± 0.006° |
β | 85.454 ± 0.006° |
γ | 74.916 ± 0.006° |
Cell volume | 1232.81 ± 0.12 Å3 |
Cell temperature | 120 ± 2 K |
Ambient diffraction temperature | 120 ± 2 K |
Number of distinct elements | 7 |
Space group number | 2 |
Hermann-Mauguin space group symbol | P -1 |
Hall space group symbol | -P 1 |
Residual factor for all reflections | 0.0295 |
Residual factor for significantly intense reflections | 0.0229 |
Weighted residual factors for significantly intense reflections | 0.0468 |
Weighted residual factors for all reflections included in the refinement | 0.0487 |
Goodness-of-fit parameter for all reflections included in the refinement | 1.017 |
Diffraction radiation probe | x-ray |
Diffraction radiation wavelength | 0.71073 Å |
Diffraction radiation type | MoKα |