Information card for entry 4518009
Formula | C75.05 H144.18 B Fe Mo N14 O0.45 P Si3 |
Calculated formula | C75.044 H144.176 B Fe Mo N14 O0.456 P Si3 |
Title of publication | Stabilization of the Dinitrogen Analogue, Phosphorus Nitride. |
Authors of publication | Martinez, Jorge L.; Lutz, Sean A.; Beagan, Daniel M.; Gao, Xinfeng; Pink, Maren; Chen, Chun-Hsing; Carta, Veronica; Moënne-Loccoz, Pierre; Smith, Jeremy M. |
Journal of publication | ACS central science |
Year of publication | 2020 |
Journal volume | 6 |
Journal issue | 9 |
Pages of publication | 1572 - 1577 |
a | 15.6007 ± 0.0007 Å |
b | 15.7039 ± 0.0007 Å |
c | 20.3019 ± 0.001 Å |
α | 90.554 ± 0.001° |
β | 102.407 ± 0.001° |
γ | 114.596 ± 0.001° |
Cell volume | 4389.3 ± 0.4 Å3 |
Cell temperature | 100 ± 2 K |
Ambient diffraction temperature | 100 ± 2 K |
Number of distinct elements | 9 |
Space group number | 2 |
Hermann-Mauguin space group symbol | P -1 |
Hall space group symbol | -P 1 |
Residual factor for all reflections | 0.1211 |
Residual factor for significantly intense reflections | 0.0744 |
Weighted residual factors for significantly intense reflections | 0.1997 |
Weighted residual factors for all reflections included in the refinement | 0.2388 |
Goodness-of-fit parameter for all reflections included in the refinement | 1.04 |
Diffraction radiation wavelength | 0.71073 Å |
Diffraction radiation type | MoKα |