Information card for entry 4518010
Formula | C75.05 H144.21 B Fe Mo N14 O0.45 P Si3 |
Calculated formula | C75.05 H144.2 B Fe Mo N14 O0.45 P Si3 |
Title of publication | Stabilization of the Dinitrogen Analogue, Phosphorus Nitride. |
Authors of publication | Martinez, Jorge L.; Lutz, Sean A.; Beagan, Daniel M.; Gao, Xinfeng; Pink, Maren; Chen, Chun-Hsing; Carta, Veronica; Moënne-Loccoz, Pierre; Smith, Jeremy M. |
Journal of publication | ACS central science |
Year of publication | 2020 |
Journal volume | 6 |
Journal issue | 9 |
Pages of publication | 1572 - 1577 |
a | 15.6017 ± 0.0011 Å |
b | 15.7015 ± 0.0012 Å |
c | 20.3141 ± 0.0016 Å |
α | 90.572 ± 0.002° |
β | 102.466 ± 0.002° |
γ | 114.617 ± 0.002° |
Cell volume | 4389.3 ± 0.6 Å3 |
Cell temperature | 100 ± 2 K |
Ambient diffraction temperature | 100 ± 2 K |
Number of distinct elements | 9 |
Space group number | 2 |
Hermann-Mauguin space group symbol | P -1 |
Hall space group symbol | -P 1 |
Residual factor for all reflections | 0.1278 |
Residual factor for significantly intense reflections | 0.0772 |
Weighted residual factors for significantly intense reflections | 0.2077 |
Weighted residual factors for all reflections included in the refinement | 0.2502 |
Goodness-of-fit parameter for all reflections included in the refinement | 1.023 |
Diffraction radiation wavelength | 0.71073 Å |
Diffraction radiation type | MoKα |