Information card for entry 4518013
Formula | C24 H14 Co N12 O8 |
Calculated formula | C24 H14 Co N12 O8 |
Title of publication | Efficient C<sub>2</sub>H<i> <sub>n</sub> </i> Hydrocarbons and VOC Adsorption and Separation in an MOF with Lewis Basic and Acidic Decorated Active Sites. |
Authors of publication | Li, Yong-Zhi; Wang, Gang-Ding; Shi, Wen-Juan; Hou, Lei; Wang, Yao-Yu; Zhu, Zhonghua |
Journal of publication | ACS applied materials & interfaces |
Year of publication | 2020 |
Journal volume | 12 |
Journal issue | 37 |
Pages of publication | 41785 - 41793 |
a | 7.301 ± 0.005 Å |
b | 20.365 ± 0.015 Å |
c | 24.831 ± 0.018 Å |
α | 90° |
β | 90° |
γ | 90° |
Cell volume | 3692 ± 5 Å3 |
Cell temperature | 296 ± 2 K |
Ambient diffraction temperature | 296 ± 2 K |
Number of distinct elements | 5 |
Space group number | 57 |
Hermann-Mauguin space group symbol | P b c m |
Hall space group symbol | -P 2c 2b |
Residual factor for all reflections | 0.1065 |
Residual factor for significantly intense reflections | 0.0574 |
Weighted residual factors for significantly intense reflections | 0.1448 |
Weighted residual factors for all reflections included in the refinement | 0.172 |
Goodness-of-fit parameter for all reflections included in the refinement | 1 |
Diffraction radiation wavelength | 0.71073 Å |
Diffraction radiation type | MoKα |