Information card for entry 4518012
Formula | C21 H54 N15 P3 |
Calculated formula | C21 H54 N15 P3 |
Title of publication | Synthesis of Tris-Phosphazene Bases with Triazine as Core and Their Applications for Efficient Ring-Opening Alternating Copolymerization of Epoxide and Anhydride: Notable Effect of Basicity and Molecular Size |
Authors of publication | Wang, Lebin; Zhang, Jinbo; Zhao, Na; Ren, Chuanli; Liu, Shaofeng; Li, Zhibo |
Journal of publication | ACS Macro Letters |
Year of publication | 2020 |
Journal volume | 9 |
Journal issue | 9 |
Pages of publication | 1398 - 1402 |
a | 23.6761 ± 0.0012 Å |
b | 7.0053 ± 0.0003 Å |
c | 22.401 ± 0.0012 Å |
α | 90° |
β | 117.192 ± 0.001° |
γ | 90° |
Cell volume | 3304.8 ± 0.3 Å3 |
Cell temperature | 193 ± 2 K |
Ambient diffraction temperature | 193 ± 2 K |
Number of distinct elements | 4 |
Space group number | 13 |
Hermann-Mauguin space group symbol | P 1 2/c 1 |
Hall space group symbol | -P 2yc |
Residual factor for all reflections | 0.0638 |
Residual factor for significantly intense reflections | 0.0454 |
Weighted residual factors for significantly intense reflections | 0.1043 |
Weighted residual factors for all reflections included in the refinement | 0.1154 |
Goodness-of-fit parameter for all reflections included in the refinement | 1.052 |
Diffraction radiation wavelength | 0.71073 Å |
Diffraction radiation type | MoKα |