Information card for entry 4518549
Formula | C18 H19 Ag5 O18 |
Calculated formula | C18 H19 Ag5 O18 |
Title of publication | Silver(I) Coordination Polymers Immobilized into Biopolymer Films for Antimicrobial Applications. |
Authors of publication | Fernandes, Tiago A.; Costa, Inês F M; Jorge, Paula; Sousa, Ana Catarina; André, Vânia; Cerca, Nuno; Kirillov, Alexander M. |
Journal of publication | ACS applied materials & interfaces |
Year of publication | 2021 |
Journal volume | 13 |
Journal issue | 11 |
Pages of publication | 12836 - 12844 |
a | 3.6227 ± 0.0002 Å |
b | 16.8605 ± 0.0007 Å |
c | 20.181 ± 0.0011 Å |
α | 90° |
β | 90.542 ± 0.003° |
γ | 90° |
Cell volume | 1232.61 ± 0.11 Å3 |
Cell temperature | 296 ± 2 K |
Ambient diffraction temperature | 296 ± 2 K |
Number of distinct elements | 4 |
Space group number | 14 |
Hermann-Mauguin space group symbol | P 1 21/n 1 |
Hall space group symbol | -P 2yn |
Residual factor for all reflections | 0.0686 |
Residual factor for significantly intense reflections | 0.0483 |
Weighted residual factors for significantly intense reflections | 0.0995 |
Weighted residual factors for all reflections included in the refinement | 0.1075 |
Goodness-of-fit parameter for all reflections included in the refinement | 1.059 |
Diffraction radiation wavelength | 0.71073 Å |
Diffraction radiation type | MoKα |