Information card for entry 4518550
Formula | C5 H4 Ag O5 |
Calculated formula | C5 H4 Ag O5 |
Title of publication | Silver(I) Coordination Polymers Immobilized into Biopolymer Films for Antimicrobial Applications. |
Authors of publication | Fernandes, Tiago A.; Costa, Inês F M; Jorge, Paula; Sousa, Ana Catarina; André, Vânia; Cerca, Nuno; Kirillov, Alexander M. |
Journal of publication | ACS applied materials & interfaces |
Year of publication | 2021 |
Journal volume | 13 |
Journal issue | 11 |
Pages of publication | 12836 - 12844 |
a | 18.0157 ± 0.0009 Å |
b | 7.5287 ± 0.0005 Å |
c | 12.3181 ± 0.0007 Å |
α | 90° |
β | 132.675 ± 0.005° |
γ | 90° |
Cell volume | 1228.36 ± 0.16 Å3 |
Cell temperature | 296 ± 2 K |
Ambient diffraction temperature | 296 ± 2 K |
Number of distinct elements | 4 |
Space group number | 15 |
Hermann-Mauguin space group symbol | C 1 2/c 1 |
Hall space group symbol | -C 2yc |
Residual factor for all reflections | 0.0361 |
Residual factor for significantly intense reflections | 0.0332 |
Weighted residual factors for significantly intense reflections | 0.087 |
Weighted residual factors for all reflections included in the refinement | 0.0899 |
Goodness-of-fit parameter for all reflections included in the refinement | 1.058 |
Diffraction radiation wavelength | 0.71073 Å |
Diffraction radiation type | MoKα |