Information card for entry 7002460
Formula | C68 H74 Cl2 N2 O2 Pt |
Calculated formula | C68 H74 Cl2 N2 O2 Pt |
Title of publication | Synthesis and structures of complexes with axially chiral isoquinolinyl-naphtholate ligands |
Authors of publication | Howard, Ruth H.; Alonso-Moreno, Carlos; Broomfield, Lewis M.; Hughes, David L.; Wright, Joseph A.; Bochmann, Manfred |
Journal of publication | Dalton Transactions |
Year of publication | 2009 |
Journal issue | 40 |
Pages of publication | 8667 - 8682 |
a | 11.32 ± 0.0004 Å |
b | 14.822 ± 0.0006 Å |
c | 19.299 ± 0.0007 Å |
α | 84.676 ± 0.002° |
β | 77.397 ± 0.002° |
γ | 74.396 ± 0.002° |
Cell volume | 3041.6 ± 0.2 Å3 |
Cell temperature | 120 ± 2 K |
Ambient diffraction temperature | 120 ± 2 K |
Number of distinct elements | 6 |
Space group number | 2 |
Hermann-Mauguin space group symbol | P -1 |
Hall space group symbol | -P 1 |
Residual factor for all reflections | 0.123 |
Residual factor for significantly intense reflections | 0.0863 |
Weighted residual factors for significantly intense reflections | 0.1583 |
Weighted residual factors for all reflections included in the refinement | 0.1784 |
Goodness-of-fit parameter for all reflections included in the refinement | 1.131 |
Diffraction radiation probe | x-ray |
Diffraction radiation wavelength | 0.71073 Å |
Diffraction radiation type | MoKα |